Reaction Details
TargetAdenosine receptor A1
LigandBDBM50581950
Substrate/Competitorn/a
Meas. Tech.ChEMBL_2157932 (CHEMBL5042682)
Ki 1.000000±n/a nM
Citation Comeo, ETrinh, PNguyen, ATNowell, CJKindon, NDSoave, MStoddart, LAWhite, JMHill, SJKellam, BHalls, MLMay, LTScammells, PJ Development and Application of Subtype-Selective Fluorescent Antagonists for the Study of the Human Adenosine A J Med Chem64:6670-6695 (2021) 
 
Adenosine receptor A1
Name:Adenosine receptor A1
Type:G Protein-Coupled Receptor (GPCR)
Mol. Mass.:36520.92
Organism:Homo sapiens (Human)
Description:P30542
Residue:326
BDBM50581950
NameBDBM50581950
Synonyms:CHEMBL4204703
TypeSmall organic molecule
Emp. Form.C18H20N4O
Mol. Mass.308.3776
SMILESO[C@H]1CC[C@@H](CC1)Nc1nc(nc2[nH]ccc12)-c1ccccc1