Reaction Details
TargetDNA polymerase beta
LigandBDBM50153117
Substrate/Competitorn/a
Meas. Tech.ChEMBL_306178 (CHEMBL830972)
IC50 11000±n/a nM
Citation Oshige, MKuramochi, KOhta, KOgawa, AKuriyama, HSugawara, FKobayashi, SSakaguchi, K Molecular design of cholesterols as inhibitors of DNA polymerase alpha. J Med Chem47:4971-4 (2004) 
 
DNA polymerase beta
Name:DNA polymerase beta
Type:PROTEIN
Mol. Mass.:38334.34
Organism:Rattus norvegicus
Description:ChEMBL_1361926
Residue:335
BDBM50153117
NameBDBM50153117
Synonyms:(S)-4-((5R,10R,13R,17R)-3-Hydroxy-5,10,13-trimethyl-hexadecahydro-cyclopenta[a]phenanthren-17-yl)-pentanoic acid | CHEMBL362353
TypeSmall organic molecule
Emp. Form.C25H42O3
Mol. Mass.390.5992
SMILESC[C@@H](CCC(O)=O)[C@H]1CCC2C3CC[C@]4(C)CC(O)CC[C@]4(C)C3CC[C@]12C