Reaction Details
TargetLeucine-rich repeat serine/threonine-protein kinase 2
LigandBDBM50584324
Substrate/Competitorn/a
Meas. Tech.ChEMBL_2159379 (CHEMBL5044129)
IC50<0.080000±n/a nM
Citation Keylor, MHGulati, AKattar, SDJohnson, REChau, RWMargrey, KAArdolino, MJZarate, CPoremba, KESimov, VMorriello, GJActon, JJPio, BYan, XPalte, RLMcMinn, SENogle, LLesburg, CAAdpressa, DLin, SNeelamkavil, SLiu, PSu, JHegde, LGWoodhouse, JDFaltus, RXiong, TCiaccio, PJPiesvaux, JOtte, KMWood, HBKennedy, MEBennett, DJDiMauro, EFFell, MJFuller, PH Structure-Guided Discovery of Aminoquinazolines as Brain-Penetrant and Selective LRRK2 Inhibitors. J Med Chem65:838-856 (2022) 
 
Leucine-rich repeat serine/threonine-protein kinase 2
Name:Leucine-rich repeat serine/threonine-protein kinase 2
Type:Protein
Mol. Mass.:286113.20
Organism:Homo sapiens (Human)
Description:Q5S007
Residue:2527
BDBM50584324
NameBDBM50584324
Synonyms:CHEMBL5088471
TypeSmall organic molecule
Emp. Form.C22H21ClN6O
Mol. Mass.420.895
SMILESClc1c(Nc2ncc3ccc(cc3n2)C2(CC22CC2)C#N)cnn1C1CCOCC1