Reaction Details
TargetIntegrin alpha-V/beta-3
LigandBDBM50153564
Substrate/Competitorn/a
Meas. Tech.ChEMBL_305375 (CHEMBL832890)
IC50 5.5±n/a nM
Citation De Corte, BLKinney, WALiu, LGhosh, SBrunner, LHoekstra, WJSantulli, RJTuman, RWBaker, JBurns, CProost, JCTounge, BADamiano, BPMaryanoff, BEJohnson, DLGalemmo, RA Piperidine-containing beta-arylpropionic acids as potent antagonists of alphavbeta3/alphavbeta5 integrins. Bioorg Med Chem Lett14:5227-32 (2004) 
 
Integrin alpha-V/beta-3
Name:Integrin alpha-V/beta-3
Type:Enzyme
Mol. Mass.:n/a
Description:n/a
Components:This complex has 2 components.
Component 1
Name:Integrin alpha-V
Synonyms:ITAV_HUMAN Integrin alpha-V/alpha-5 VNRA Vitronectin receptor | Vitronectin receptor subunit alpha
Type:PROTEIN
Mol. Mass.:116024.92
Organism:Homo sapiens (Human)
Description:ChEMBL_582336
Residue:1048
Component 2
Name:Integrin beta-3
Synonyms:CD_antigen=CD61 GPIIIa ITGB3 Platelet membrane glycoprotein IIIa
Type:Protein
Mol. Mass.:87038.91
Organism:Homo sapiens (Human)
Description:P05106
Residue:788
BDBM50153564
NameBDBM50153564
Synonyms:3-({1-[3-(5-Hydroxy-1,4,5,6-tetrahydro-pyridin-2-ylamino)-benzoyl]-piperidine-4-carbonyl}-amino)-3-quinolin-3-yl-propionic acid | CHEMBL185349
TypeSmall organic molecule
Emp. Form.C30H33N5O5
Mol. Mass.543.6135
SMILESOC1CCC(Nc2cccc(c2)C(=O)N2CCC(CC2)C(=O)NC(CC(O)=O)c2cnc3ccccc3c2)=NC1