Reaction Details
TargetProtein farnesyltransferase subunit beta/geranylgeranyltransferase type-1 subunit alpha
LigandBDBM50153786
Substrate/Competitorn/a
Meas. Tech.ChEMBL_305040 (CHEMBL831678)
IC50 0.32±n/a nM
Citation Li, QWang, GTLi, TGwaltney, SLWoods, KWClaiborne, AWang, XGu, WCohen, JStoll, VSHutchins, CFrost, DRosenberg, SHSham, HL Synthesis and activity of 1-aryl-1'-imidazolyl methyl ethers as non-thiol farnesyltransferase inhibitors. Bioorg Med Chem Lett14:5371-6 (2004) 
 
Protein farnesyltransferase subunit beta/geranylgeranyltransferase type-1 subunit alpha
Name:Protein farnesyltransferase subunit beta/geranylgeranyltransferase type-1 subunit alpha
Type:Protein Complex
Mol. Mass.:n/a
Description:Purified bovine brain FTase.
Components:This complex has 2 components.
Component 1
Name:Protein farnesyltransferase/geranylgeranyltransferase type-1 subunit alpha
Synonyms:CAAX farnesyltransferase alpha subunit FNTA_BOVIN GGTase-I-alpha Protein Farnesyltransferase (PFT) Chain A Protein farnesyltransferase/geranylgeranyltransferase type I alpha subunit Type I protein geranyl-geranyltransferase alpha subunit
Type:Enzyme
Mol. Mass.:43827.38
Organism:Bos taurus (bovine)
Description:The enzyme was purified from a bovine brain homogenate by sequential ammonium sulfate fractionation and affinity chromatography.
Residue:375
Component 2
Name:Protein farnesyltransferase subunit beta
Synonyms:CAAX farnesyltransferase subunit beta FNTB_BOVIN Protein farnesyltransferase Protein farnesyltransferase subunit beta Ras proteins prenyltransferase subunit beta
Type:Enzyme Subunit
Mol. Mass.:48758.49
Organism:Bos taurus (bovine)
Description:Protein farnesyltransferase subunit beta
Residue:437
BDBM50153786
NameBDBM50153786
Synonyms:4-((5-((4-cyanophenoxy)methyl)-1H-imidazol-1-yl)methyl)-2-(naphthalen-1-yl)benzonitrile CHEMBL186617
TypeSmall organic molecule
Emp. Form.C29H20N4O
Mol. Mass.440.4953
SMILESN#Cc1ccc(OCc2cncn2Cc2ccc(C#N)c(c2)-c2cccc3ccccc23)cc1