Reaction Details
TargetProtein farnesyltransferase subunit beta/geranylgeranyltransferase type-1 subunit alpha
LigandBDBM50153166
Substrate/Competitorn/a
Meas. Tech.ChEMBL_310472 (CHEMBL834416)
EC50 7.7±n/a nM
Citation Li, QWang, GTLi, TGwaltney, SLWoods, KWClaiborne, AWang, XGu, WCohen, JStoll, VSHutchins, CFrost, DRosenberg, SHSham, HL Synthesis and activity of 1-aryl-1'-imidazolyl methyl ethers as non-thiol farnesyltransferase inhibitors. Bioorg Med Chem Lett14:5371-6 (2004) 
 
Protein farnesyltransferase subunit beta/geranylgeranyltransferase type-1 subunit alpha
Name:Protein farnesyltransferase subunit beta/geranylgeranyltransferase type-1 subunit alpha
Type:n/a
Mol. Mass.:n/a
Description:ASSAY_ID of EBI is 38702
Components:This complex has 2 components.
Component 1
Name:Protein farnesyltransferase/geranylgeranyltransferase type-1 subunit alpha
Synonyms:CAAX farnesyltransferase subunit alpha FTase-alpha GGTase-I-alpha Protein farnesyltransferase/geranylgeranyltransferase type-1 subunit alpha Type I protein geranyl-geranyltransferase subunit alpha
Type:PROTEIN
Mol. Mass.:43994.09
Organism:Mus musculus
Description:EBI_10570
Residue:377
Component 2
Name:Protein farnesyltransferase subunit beta
Synonyms:FNTB_MOUSE Protein farnesyltransferase
Type:PROTEIN
Mol. Mass.:48811.61
Organism:Mus musculus
Description:EBI_12341
Residue:437
BDBM50153166
NameBDBM50153166
Synonyms:3''-Chloro-6-[3-(4-cyano-benzyl)-3H-imidazol-4-ylmethoxymethyl]-biphenyl-3-carbonitrile CHEMBL186906
TypeSmall organic molecule
Emp. Form.C26H19ClN4O
Mol. Mass.438.908
SMILESClc1cccc(c1)-c1cc(ccc1COCc1cncn1Cc1ccc(cc1)C#N)C#N