Reaction Details
TargetMitogen-activated protein kinase 14
LigandBDBM50153847
Substrate/Competitorn/a
Meas. Tech.ChEMBL_305841 (CHEMBL829582)
IC50 20±n/a nM
Citation Brown, DSBelfield, AJBrown, GRCampbell, DFoubister, AMasters, DJPike, KGSnelson, WLWells, SL A novel series of p38 MAP kinase inhibitors for the potential treatment of rheumatoid arthritis. Bioorg Med Chem Lett14:5383-7 (2004) 
 
Mitogen-activated protein kinase 14
Name:Mitogen-activated protein kinase 14
Type:Serine/threonine-protein kinase
Mol. Mass.:41286.76
Organism:Homo sapiens (Human)
Description:Q16539
Residue:360
BDBM50153847
NameBDBM50153847
Synonyms:3-Fluoro-N-{4-methyl-3-[4-(pyridin-2-ylmethoxy)-benzoylamino]-phenyl}-5-pyrrolidin-1-yl-benzamide | CHEMBL184712
TypeSmall organic molecule
Emp. Form.C31H29FN4O3
Mol. Mass.524.5854
SMILESCc1ccc(NC(=O)c2cc(F)cc(c2)N2CCCC2)cc1NC(=O)c1ccc(OCc2ccccn2)cc1