Reaction Details
TargetKappa-type opioid receptor
LigandBDBM50154036
Substrate/Competitorn/a
Meas. Tech.ChEMBL_302991 (CHEMBL830230)
Ki 124±n/a nM
Citation Breslin, HJMiskowski, TARafferty, BMCoutinho, SVPalmer, JMWallace, NHSchneider, CRKimball, ESZhang, SPLi, JColburn, RWStone, DJMartinez, RPHe, W Rationale, design, and synthesis of novel phenyl imidazoles as opioid receptor agonists for gastrointestinal disorders. J Med Chem47:5009-20 (2004) 
 
Kappa-type opioid receptor
Name:Kappa-type opioid receptor
Type:G Protein-Coupled Receptor (GPCR)
Mol. Mass.:42744.99
Organism:Cavia porcellus (domestic guinea pig)
Description:P41144
Residue:380
BDBM50154036
NameBDBM50154036
Synonyms:(S)-2-amino-3-(4-hydroxyphenyl)-1-((S)-3-(4-phenyl-1H-imidazol-2-yl)-3,4-dihydroisoquinolin-2(1H)-yl)propan-1-one CHEMBL361274
TypeSmall organic molecule
Emp. Form.C27H26N4O2
Mol. Mass.438.5209
SMILESN[C@@H](Cc1ccc(O)cc1)C(=O)N1Cc2ccccc2C[C@H]1c1nc(c[nH]1)-c1ccccc1