Reaction Details
TargetTyrosine-protein kinase JAK1
LigandBDBM50585518
Substrate/Competitorn/a
Meas. Tech.ChEMBL_2162565 (CHEMBL5047426)
IC50 5.0±n/a nM
Citation Wellaway, CRBaldwin, IRBamborough, PBarker, DBartholomew, MAChung, CWDümpelfeld, BEvans, JPFazakerley, NJHomes, PKeeling, SPLewell, XQMcNab, FWMorley, JNeedham, DNeu, Mvan Oosterhout, AJMPal, AReinhard, FBMRianjongdee, FRobertson, CMRowland, PShah, RRSherriff, EBSloan, LATeague, SThomas, DAWellaway, NWojno-Picon, JWoolven, JMCoe, DM Investigation of Janus Kinase (JAK) Inhibitors for Lung Delivery and the Importance of Aldehyde Oxidase Metabolism. J Med Chem65:633-664 (2022) 
 
Tyrosine-protein kinase JAK1
Name:Tyrosine-protein kinase JAK1
Type:Protein
Mol. Mass.:133293.73
Organism:Homo sapiens (Human)
Description:P23458
Residue:1154
BDBM50585518
NameBDBM50585518
Synonyms:CHEMBL5094089
TypeSmall organic molecule
Emp. Form.C25H34FN5O3
Mol. Mass.471.5676
SMILESCCc1cc(O)c(F)cc1-c1cc(N[C@@H](C)CO)c2nc(NCCOCCN(C)C)ncc2c1