Reaction Details
TargetTyrosine-protein kinase JAK2
LigandBDBM50585508
Substrate/Competitorn/a
Meas. Tech.ChEMBL_2162566 (CHEMBL5047427)
IC50 2.5±n/a nM
Citation Wellaway, CRBaldwin, IRBamborough, PBarker, DBartholomew, MAChung, CWDümpelfeld, BEvans, JPFazakerley, NJHomes, PKeeling, SPLewell, XQMcNab, FWMorley, JNeedham, DNeu, Mvan Oosterhout, AJMPal, AReinhard, FBMRianjongdee, FRobertson, CMRowland, PShah, RRSherriff, EBSloan, LATeague, SThomas, DAWellaway, NWojno-Picon, JWoolven, JMCoe, DM Investigation of Janus Kinase (JAK) Inhibitors for Lung Delivery and the Importance of Aldehyde Oxidase Metabolism. J Med Chem65:633-664 (2022) 
 
Tyrosine-protein kinase JAK2
Name:Tyrosine-protein kinase JAK2
Type:Protein
Mol. Mass.:130684.68
Organism:Homo sapiens (Human)
Description:O60674
Residue:1132
BDBM50585508
NameBDBM50585508
Synonyms:CHEMBL5079248
TypeSmall organic molecule
Emp. Form.C19H21FN4O2
Mol. Mass.356.394
SMILESCCc1cc(O)c(F)cc1-c1cc(NC[C@@H](C)O)c2nc(N)ncc2c1