Reaction Details
TargetTyrosine-protein kinase JAK3
LigandBDBM50585516
Substrate/Competitorn/a
Meas. Tech.ChEMBL_2162567 (CHEMBL5047428)
IC50 3.2±n/a nM
Citation Wellaway, CRBaldwin, IRBamborough, PBarker, DBartholomew, MAChung, CWDümpelfeld, BEvans, JPFazakerley, NJHomes, PKeeling, SPLewell, XQMcNab, FWMorley, JNeedham, DNeu, Mvan Oosterhout, AJMPal, AReinhard, FBMRianjongdee, FRobertson, CMRowland, PShah, RRSherriff, EBSloan, LATeague, SThomas, DAWellaway, NWojno-Picon, JWoolven, JMCoe, DM Investigation of Janus Kinase (JAK) Inhibitors for Lung Delivery and the Importance of Aldehyde Oxidase Metabolism. J Med Chem65:633-664 (2022) 
 
Tyrosine-protein kinase JAK3
Name:Tyrosine-protein kinase JAK3
Type:Protein
Mol. Mass.:125111.08
Organism:Homo sapiens (Human)
Description:P52333
Residue:1124
BDBM50585516
NameBDBM50585516
Synonyms:CHEMBL5075673
TypeSmall organic molecule
Emp. Form.C23H26FN5O
Mol. Mass.407.4838
SMILES[H][C@]12CC[C@]([H])(C[C@H](C1)Nc1cc(cc3cnc(N)nc13)-c1cc(F)c(O)cc1CC)N2