Reaction Details
TargetTyrosine-protein kinase JAK3
LigandBDBM50585518
Substrate/Competitorn/a
Meas. Tech.ChEMBL_2162567 (CHEMBL5047428)
IC50 3.2±n/a nM
Citation Wellaway, CRBaldwin, IRBamborough, PBarker, DBartholomew, MAChung, CWDümpelfeld, BEvans, JPFazakerley, NJHomes, PKeeling, SPLewell, XQMcNab, FWMorley, JNeedham, DNeu, Mvan Oosterhout, AJMPal, AReinhard, FBMRianjongdee, FRobertson, CMRowland, PShah, RRSherriff, EBSloan, LATeague, SThomas, DAWellaway, NWojno-Picon, JWoolven, JMCoe, DM Investigation of Janus Kinase (JAK) Inhibitors for Lung Delivery and the Importance of Aldehyde Oxidase Metabolism. J Med Chem65:633-664 (2022) 
 
Tyrosine-protein kinase JAK3
Name:Tyrosine-protein kinase JAK3
Type:Protein
Mol. Mass.:125111.08
Organism:Homo sapiens (Human)
Description:P52333
Residue:1124
BDBM50585518
NameBDBM50585518
Synonyms:CHEMBL5094089
TypeSmall organic molecule
Emp. Form.C25H34FN5O3
Mol. Mass.471.5676
SMILESCCc1cc(O)c(F)cc1-c1cc(N[C@@H](C)CO)c2nc(NCCOCCN(C)C)ncc2c1