Reaction Details
TargetMu-type opioid receptor
LigandBDBM50155069
Substrate/Competitorn/a
Meas. Tech.ChEBML_302753
Ki 1±n/a nM
Citation Coats, SJSchulz, MJCarson, JRCodd, EEHlasta, DJPitis, PMStone, DJZhang, SPColburn, RWDax, SL Parallel methods for the preparation and SAR exploration of N-ethyl-4-[(8-alkyl-8-aza-bicyclo[3.2.1]oct-3-ylidene)-aryl-methyl]-benzamides, powerful mu and delta opioid agonists. Bioorg Med Chem Lett14:5493-8 (2004) 
 
Mu-type opioid receptor
Name:Mu-type opioid receptor
Type:Enzyme Catalytic Domain
Mol. Mass.:44431.62
Organism:MOUSE
Description:OPIATE Mu OPRM1 MOUSE::P42866
Residue:398
BDBM50155069
NameBDBM50155069
Synonyms:4-[Cyano-(8-furan-3-ylmethyl-8-aza-bicyclo[3.2.1]oct-3-ylidene)-methyl]-N-ethyl-benzamide | CHEMBL185906
TypeSmall organic molecule
Emp. Form.C23H25N3O2
Mol. Mass.375.4635
SMILES[#6]-[#6]-[#7]-[#6](=O)-c1ccc(cc1)-[#6](\C#N)=[#6]-1/[#6]-[#6]-2-[#6]-[#6]-[#6](-[#6]-1)-[#7]-2-[#6]-c1ccoc1