Reaction Details
TargetMu-type opioid receptor
LigandBDBM50155076
Substrate/Competitorn/a
Meas. Tech.ChEBML_302753
Ki 1.2±n/a nM
Citation Coats, SJSchulz, MJCarson, JRCodd, EEHlasta, DJPitis, PMStone, DJZhang, SPColburn, RWDax, SL Parallel methods for the preparation and SAR exploration of N-ethyl-4-[(8-alkyl-8-aza-bicyclo[3.2.1]oct-3-ylidene)-aryl-methyl]-benzamides, powerful mu and delta opioid agonists. Bioorg Med Chem Lett14:5493-8 (2004) 
 
Mu-type opioid receptor
Name:Mu-type opioid receptor
Type:Enzyme Catalytic Domain
Mol. Mass.:44431.62
Organism:MOUSE
Description:OPIATE Mu OPRM1 MOUSE::P42866
Residue:398
BDBM50155076
NameBDBM50155076
Synonyms:CHEMBL186530 | N-Ethyl-4-[(8-furan-3-ylmethyl-8-aza-bicyclo[3.2.1]oct-3-ylidene)-pyridin-3-yl-methyl]-benzamide
TypeSmall organic molecule
Emp. Form.C27H29N3O2
Mol. Mass.427.5381
SMILES[#6]-[#6]-[#7]-[#6](=O)-c1ccc(cc1)-[#6](=[#6]-1/[#6]-[#6]-2-[#6]-[#6]-[#6](-[#6]-1)-[#7]-2-[#6]-c1ccoc1)\c1cccnc1