Reaction Details
TargetMu-type opioid receptor
LigandBDBM50155124
Substrate/Competitorn/a
Meas. Tech.ChEBML_302753
Ki 0.200000±n/a nM
Citation Coats, SJSchulz, MJCarson, JRCodd, EEHlasta, DJPitis, PMStone, DJZhang, SPColburn, RWDax, SL Parallel methods for the preparation and SAR exploration of N-ethyl-4-[(8-alkyl-8-aza-bicyclo[3.2.1]oct-3-ylidene)-aryl-methyl]-benzamides, powerful mu and delta opioid agonists. Bioorg Med Chem Lett14:5493-8 (2004) 
 
Mu-type opioid receptor
Name:Mu-type opioid receptor
Type:Enzyme Catalytic Domain
Mol. Mass.:44431.62
Organism:MOUSE
Description:OPIATE Mu OPRM1 MOUSE::P42866
Residue:398
BDBM50155124
NameBDBM50155124
Synonyms:4-{Bromo-[(1S,5R)-8-furan-3-ylmethyl-8-aza-bicyclo[3.2.1]oct-(3E)-ylidene]-methyl}-N-ethyl-benzamide | CHEMBL185980
TypeSmall organic molecule
Emp. Form.C22H25BrN2O2
Mol. Mass.429.35
SMILESCCNC(=O)c1ccc(cc1)C(\Br)=C1\C[C@@H]2CC[C@H](C1)N2Cc1ccoc1