Reaction Details
TargetPeroxisomal acyl-coenzyme A oxidase 1
LigandBDBM50156434
Substrate/Competitorn/a
Meas. Tech.ChEMBL_311972 (CHEMBL834389)
IC50 4410±n/a nM
Citation Elzein, EIbrahim, PKoltun, DORehder, KShenk, KDMarquart, TAJiang, BLi, XNatero, RLi, YNguyen, MKerwar, SChu, NSoohoo, DHao, JMaydanik, VYLustig, DAZeng, DLeung, KZablocki, JA CVT-4325: a potent fatty acid oxidation inhibitor with favorable oral bioavailability. Bioorg Med Chem Lett14:6017-21 (2004) 
 
Peroxisomal acyl-coenzyme A oxidase 1
Name:Peroxisomal acyl-coenzyme A oxidase 1
Type:PROTEIN
Mol. Mass.:74693.04
Organism:Rattus norvegicus
Description:ChEMBL_311972
Residue:661
BDBM50156434
NameBDBM50156434
Synonyms:4-(3-{4-[(R)-2-Hydroxy-3-(2-methyl-benzothiazol-5-yloxy)-propyl]-piperazin-1-ylmethyl}-[1,2,4]oxadiazol-5-yl)-benzonitrile | CHEMBL187231
TypeSmall organic molecule
Emp. Form.C25H26N6O3S
Mol. Mass.490.577
SMILESCc1nc2cc(OC[C@H](O)CN3CCN(Cc4noc(n4)-c4ccc(cc4)C#N)CC3)ccc2s1