Reaction Details
TargetReverse transcriptase/RNaseH
LigandBDBM2950
Substrate/Competitorn/a
Meas. Tech.ChEMBL_305433 (CHEMBL830926)
IC50 896±n/a nM
Citation Balaji, SKarthikeyan, CMoorthy, NSTrivedi, P QSAR modelling of HIV-1 reverse transcriptase inhibition by benzoxazinones using a combination of P_VSA and pharmacophore feature descriptors. Bioorg Med Chem Lett14:6089-94 (2004) 
 
Reverse transcriptase/RNaseH
Name:Reverse transcriptase/RNaseH
Type:PROTEIN
Mol. Mass.:65229.15
Organism:Human immunodeficiency virus 1
Description:ChEMBL_1473730
Residue:566
BDBM2950
NameBDBM2950
Synonyms:6-amino-4-(3-methylbut-1-yn-1-yl)-4-(trifluoromethyl)-2,4-dihydro-1H-3,1-benzoxazin-2-one CHEMBL111001
TypeSmall organic molecule
Emp. Form.C14H13F3N2O2
Mol. Mass.298.2604
SMILESCC(C)C#CC1(OC(=O)Nc2ccc(N)cc12)C(F)(F)F