Reaction Details
TargetReverse transcriptase/RNaseH
LigandBDBM2939
Substrate/Competitorn/a
Meas. Tech.ChEMBL_305433 (CHEMBL830926)
IC50 78±n/a nM
Citation Balaji, SKarthikeyan, CMoorthy, NSTrivedi, P QSAR modelling of HIV-1 reverse transcriptase inhibition by benzoxazinones using a combination of P_VSA and pharmacophore feature descriptors. Bioorg Med Chem Lett14:6089-94 (2004) 
 
Reverse transcriptase/RNaseH
Name:Reverse transcriptase/RNaseH
Type:PROTEIN
Mol. Mass.:65229.15
Organism:Human immunodeficiency virus 1
Description:ChEMBL_1473730
Residue:566
BDBM2939
NameBDBM2939
Synonyms:4-(2-cyclopropylethynyl)-5-fluoro-4-(trifluoromethyl)-2,4-dihydro-1H-3,1-benzoxazin-2-one CHEMBL320078
TypeSmall organic molecule
Emp. Form.C14H9F4NO2
Mol. Mass.299.2204
SMILESFc1cccc2NC(=O)OC(C#CC3CC3)(c12)C(F)(F)F