Reaction Details
TargetAndrogen receptor
LigandBDBM18162
Substrate/Competitorn/a
Meas. Tech.ChEMBL_312479 (CHEMBL833228)
IC50>5000±n/a nM
Citation Balog, ASalvati, MEShan, WMathur, ALeith, LWWei, DDAttar, RMGeng, JRizzo, CAWang, CKrystek, SRTokarski, JSHunt, JTGottardis, MWeinmann, R The synthesis and evaluation of [2.2.1]-bicycloazahydantoins as androgen receptor antagonists. Bioorg Med Chem Lett14:6107-11 (2004) 
 
Androgen receptor
Name:Androgen receptor
Type:Receptor
Mol. Mass.:99185.27
Organism:Homo sapiens (Human)
Description:CHO cells were stably transfected with human AR gene.
Residue:920
BDBM18162
NameBDBM18162
Synonyms:(1R,6R,7S)-4-(4-nitronaphthalen-1-yl)-2,4-diazatricyclo[5.2.1.0^{2,6}]decane-3,5-dione N-aryl-bicyclic hydantoin, 4a
TypeSmall organic molecule
Emp. Form.C18H15N3O4
Mol. Mass.337.3294
SMILESOc1c2[C@H]3CC[C@H](C3)n2c(=O)n1-c1ccc([N+]([O-])=O)c2ccccc12