Reaction Details
TargetAndrogen receptor
LigandBDBM50156504
Substrate/Competitorn/a
Meas. Tech.ChEMBL_312479 (CHEMBL833228)
IC50 3920±n/a nM
Citation Balog, ASalvati, MEShan, WMathur, ALeith, LWWei, DDAttar, RMGeng, JRizzo, CAWang, CKrystek, SRTokarski, JSHunt, JTGottardis, MWeinmann, R The synthesis and evaluation of [2.2.1]-bicycloazahydantoins as androgen receptor antagonists. Bioorg Med Chem Lett14:6107-11 (2004) 
 
Androgen receptor
Name:Androgen receptor
Type:Receptor
Mol. Mass.:99185.27
Organism:Homo sapiens (Human)
Description:CHO cells were stably transfected with human AR gene.
Residue:920
BDBM50156504
NameBDBM50156504
Synonyms:(1S,6R,7S)-4-(4-Cyano-3-trifluoromethyl-phenyl)-3,5-dioxo-2,4,8-triaza-tricyclo[5.2.1.0*2,6*]decane-8-carboxylic acid 4-fluoro-phenyl ester | CHEMBL362566
TypeSmall organic molecule
Emp. Form.C22H14F4N4O4
Mol. Mass.474.3646
SMILESOc1c2[C@@H]3C[C@@H](CN3C(=O)Oc3ccc(F)cc3)n2c(=O)n1-c1ccc(C#N)c(c1)C(F)(F)F