Reaction Details
TargetAndrogen receptor
LigandBDBM50156507
Substrate/Competitorn/a
Meas. Tech.ChEMBL_312372 (CHEMBL836730)
IC50 250±n/a nM
Citation Balog, ASalvati, MEShan, WMathur, ALeith, LWWei, DDAttar, RMGeng, JRizzo, CAWang, CKrystek, SRTokarski, JSHunt, JTGottardis, MWeinmann, R The synthesis and evaluation of [2.2.1]-bicycloazahydantoins as androgen receptor antagonists. Bioorg Med Chem Lett14:6107-11 (2004) 
 
Androgen receptor
Name:Androgen receptor
Type:Receptor
Mol. Mass.:99185.27
Organism:Homo sapiens (Human)
Description:CHO cells were stably transfected with human AR gene.
Residue:920
BDBM50156507
NameBDBM50156507
Synonyms:(1R,6S,7R)-4-(4-Nitro-phenyl)-3,5-dioxo-2,4,8-triaza-tricyclo[5.2.1.0*2,6*]decane-8-carboxylic acid tert-butyl ester | CHEMBL364393
TypeSmall organic molecule
Emp. Form.C18H20N4O6
Mol. Mass.388.3746
SMILESCC(C)(C)OC(=O)N1C[C@H]2C[C@@H]1c1c(O)n(-c3ccc(cc3)[N+]([O-])=O)c(=O)n21