Reaction Details
TargetAndrogen receptor
LigandBDBM50156511
Substrate/Competitorn/a
Meas. Tech.ChEMBL_312372 (CHEMBL836730)
IC50 1330±n/a nM
Citation Balog, ASalvati, MEShan, WMathur, ALeith, LWWei, DDAttar, RMGeng, JRizzo, CAWang, CKrystek, SRTokarski, JSHunt, JTGottardis, MWeinmann, R The synthesis and evaluation of [2.2.1]-bicycloazahydantoins as androgen receptor antagonists. Bioorg Med Chem Lett14:6107-11 (2004) 
 
Androgen receptor
Name:Androgen receptor
Type:Receptor
Mol. Mass.:99185.27
Organism:Homo sapiens (Human)
Description:CHO cells were stably transfected with human AR gene.
Residue:920
BDBM50156511
NameBDBM50156511
Synonyms:(1S,6S,7S)-4-(4-Nitro-naphthalen-1-yl)-3,5-dioxo-2,4,8-triaza-tricyclo[5.2.1.0*2,6*]decane-8-carboxylic acid tert-butyl ester | CHEMBL188545
TypeSmall organic molecule
Emp. Form.C22H22N4O6
Mol. Mass.438.4333
SMILESCC(C)(C)OC(=O)N1C[C@@H]2C[C@H]1c1c(O)n(-c3ccc([N+]([O-])=O)c4ccccc34)c(=O)n21