Reaction Details
TargetAndrogen receptor
LigandBDBM50156514
Substrate/Competitorn/a
Meas. Tech.ChEMBL_312372 (CHEMBL836730)
IC50 60±n/a nM
Citation Balog, ASalvati, MEShan, WMathur, ALeith, LWWei, DDAttar, RMGeng, JRizzo, CAWang, CKrystek, SRTokarski, JSHunt, JTGottardis, MWeinmann, R The synthesis and evaluation of [2.2.1]-bicycloazahydantoins as androgen receptor antagonists. Bioorg Med Chem Lett14:6107-11 (2004) 
 
Androgen receptor
Name:Androgen receptor
Type:Receptor
Mol. Mass.:99185.27
Organism:Homo sapiens (Human)
Description:CHO cells were stably transfected with human AR gene.
Residue:920
BDBM50156514
NameBDBM50156514
Synonyms:(1S,6R,7S)-8-(4-Butyl-benzoyl)-4-(4-nitro-phenyl)-2,4,8-triaza-tricyclo[5.2.1.0*2,6*]decane-3,5-dione | CHEMBL365482
TypeSmall organic molecule
Emp. Form.C24H24N4O5
Mol. Mass.448.4712
SMILESCCCCc1ccc(cc1)C(=O)N1C[C@@H]2C[C@H]1c1c(O)n(-c3ccc(cc3)[N+]([O-])=O)c(=O)n21