Reaction Details
TargetAndrogen receptor
LigandBDBM50156506
Substrate/Competitorn/a
Meas. Tech.ChEMBL_312479 (CHEMBL833228)
IC50 4380±n/a nM
Citation Balog, ASalvati, MEShan, WMathur, ALeith, LWWei, DDAttar, RMGeng, JRizzo, CAWang, CKrystek, SRTokarski, JSHunt, JTGottardis, MWeinmann, R The synthesis and evaluation of [2.2.1]-bicycloazahydantoins as androgen receptor antagonists. Bioorg Med Chem Lett14:6107-11 (2004) 
 
Androgen receptor
Name:Androgen receptor
Type:Receptor
Mol. Mass.:99185.27
Organism:Homo sapiens (Human)
Description:CHO cells were stably transfected with human AR gene.
Residue:920
BDBM50156506
NameBDBM50156506
Synonyms:(1S,6S,7S)-4-(4-Cyano-3-trifluoromethyl-phenyl)-3,5-dioxo-2,4,8-triaza-tricyclo[5.2.1.0*2,6*]decane-8-carboxylic acid tert-butyl ester CHEMBL414845
TypeSmall organic molecule
Emp. Form.C20H19F3N4O4
Mol. Mass.436.3845
SMILESCC(C)(C)OC(=O)N1C[C@@H]2C[C@H]1c1c(O)n(-c3ccc(C#N)c(c3)C(F)(F)F)c(=O)n21