Reaction Details
TargetAndrogen receptor
LigandBDBM50156515
Substrate/Competitorn/a
Meas. Tech.ChEMBL_312372 (CHEMBL836730)
IC50 10±n/a nM
Citation Balog, ASalvati, MEShan, WMathur, ALeith, LWWei, DDAttar, RMGeng, JRizzo, CAWang, CKrystek, SRTokarski, JSHunt, JTGottardis, MWeinmann, R The synthesis and evaluation of [2.2.1]-bicycloazahydantoins as androgen receptor antagonists. Bioorg Med Chem Lett14:6107-11 (2004) 
 
Androgen receptor
Name:Androgen receptor
Type:Receptor
Mol. Mass.:99185.27
Organism:Homo sapiens (Human)
Description:CHO cells were stably transfected with human AR gene.
Residue:920
BDBM50156515
NameBDBM50156515
Synonyms:(1R,2R,6S,7S)-4-(4-Nitro-3-trifluoromethyl-phenyl)-4-aza-tricyclo[5.2.1.0*2,6*]decane-3,5-dione | CHEMBL188297
TypeSmall organic molecule
Emp. Form.C16H13F3N2O4
Mol. Mass.354.2806
SMILESOc1c2[C@H]3CC[C@H](C3)c2c(O)n1-c1ccc(c(c1)C(F)(F)F)[N+]([O-])=O