Reaction Details
TargetAndrogen receptor
LigandBDBM50156518
Substrate/Competitorn/a
Meas. Tech.ChEMBL_312372 (CHEMBL836730)
IC50 580±n/a nM
Citation Balog, ASalvati, MEShan, WMathur, ALeith, LWWei, DDAttar, RMGeng, JRizzo, CAWang, CKrystek, SRTokarski, JSHunt, JTGottardis, MWeinmann, R The synthesis and evaluation of [2.2.1]-bicycloazahydantoins as androgen receptor antagonists. Bioorg Med Chem Lett14:6107-11 (2004) 
 
Androgen receptor
Name:Androgen receptor
Type:Receptor
Mol. Mass.:99185.27
Organism:Homo sapiens (Human)
Description:CHO cells were stably transfected with human AR gene.
Residue:920
BDBM50156518
NameBDBM50156518
Synonyms:4-[(1S,6R,7S)-8-(4-Butyl-benzoyl)-3,5-dioxo-2,4,8-triaza-tricyclo[5.2.1.0*2,6*]dec-4-yl]-benzonitrile | CHEMBL371392
TypeSmall organic molecule
Emp. Form.C25H24N4O3
Mol. Mass.428.4831
SMILESCCCCc1ccc(cc1)C(=O)N1C[C@@H]2C[C@H]1c1c(O)n(-c3ccc(cc3)C#N)c(=O)n21