Reaction Details
TargetAndrogen receptor
LigandBDBM50156521
Substrate/Competitorn/a
Meas. Tech.ChEMBL_312479 (CHEMBL833228)
IC50 2540±n/a nM
Citation Balog, ASalvati, MEShan, WMathur, ALeith, LWWei, DDAttar, RMGeng, JRizzo, CAWang, CKrystek, SRTokarski, JSHunt, JTGottardis, MWeinmann, R The synthesis and evaluation of [2.2.1]-bicycloazahydantoins as androgen receptor antagonists. Bioorg Med Chem Lett14:6107-11 (2004) 
 
Androgen receptor
Name:Androgen receptor
Type:Receptor
Mol. Mass.:99185.27
Organism:Homo sapiens (Human)
Description:CHO cells were stably transfected with human AR gene.
Residue:920
BDBM50156521
NameBDBM50156521
Synonyms:(1S,6R,7S)-8-Benzoyl-4-(4-nitro-phenyl)-2,4,8-triaza-tricyclo[5.2.1.0*2,6*]decane-3,5-dione | CHEMBL365650
TypeSmall organic molecule
Emp. Form.C20H16N4O5
Mol. Mass.392.3648
SMILESOc1c2[C@@H]3C[C@@H](CN3C(=O)c3ccccc3)n2c(=O)n1-c1ccc(cc1)[N+]([O-])=O