Reaction Details
TargetAndrogen receptor
LigandBDBM50156508
Substrate/Competitorn/a
Meas. Tech.ChEMBL_312372 (CHEMBL836730)
IC50 580±n/a nM
Citation Balog, ASalvati, MEShan, WMathur, ALeith, LWWei, DDAttar, RMGeng, JRizzo, CAWang, CKrystek, SRTokarski, JSHunt, JTGottardis, MWeinmann, R The synthesis and evaluation of [2.2.1]-bicycloazahydantoins as androgen receptor antagonists. Bioorg Med Chem Lett14:6107-11 (2004) 
 
Androgen receptor
Name:Androgen receptor
Type:Receptor
Mol. Mass.:99185.27
Organism:Homo sapiens (Human)
Description:CHO cells were stably transfected with human AR gene.
Residue:920
BDBM50156508
NameBDBM50156508
Synonyms:(1S,6R,7S)-4-(4-Cyano-naphthalen-1-yl)-3,5-dioxo-2,4,8-triaza-tricyclo[5.2.1.0*2,6*]decane-8-carboxylic acid 4-fluoro-phenyl ester | CHEMBL365921
TypeSmall organic molecule
Emp. Form.C25H17FN4O4
Mol. Mass.456.4253
SMILESOc1c2[C@@H]3C[C@@H](CN3C(=O)Oc3ccc(F)cc3)n2c(=O)n1-c1ccc(C#N)c2ccccc12