Reaction Details
TargetPolyunsaturated fatty acid 5-lipoxygenase
LigandBDBM50000829
Substrate/Competitorn/a
Meas. Tech.ChEMBL_429564 (CHEMBL919562)
IC50 83±n/a nM
Citation Pommery, NTaverne, TTelliez, AGoossens, LCharlier, CPommery, JGoossens, JFHoussin, RDurant, FHénichart, JP New COX-2/5-LOX inhibitors: apoptosis-inducing agents potentially useful in prostate cancer chemotherapy. J Med Chem47:6195-206 (2004) 
 
Polyunsaturated fatty acid 5-lipoxygenase
Name:Polyunsaturated fatty acid 5-lipoxygenase
Type:Enzyme
Mol. Mass.:77972.74
Organism:Homo sapiens (Human)
Description:Recombinant protein was purified from E. coli lysate. After ammonium sulfate precipitation and subsequent steps, the supernatant (S100) was used for 5-LO activity assay.
Residue:674
BDBM50000829
NameBDBM50000829
Synonyms:6-((3-fluoro-5-(4-methoxytetrahydro-2H-pyran-4-yl)phenoxy)methyl)-1-methylquinolin-2(1H)-one 6-[3-Fluoro-5-(tetrahydro-pyran-4-yl)-phenoxymethyl]-1-methyl-1H-quinolin-2-one ZD-2138
TypeSmall organic molecule
Emp. Form.C23H24FNO4
Mol. Mass.397.4394
SMILESCOC1(CCOCC1)c1cc(F)cc(OCc2ccc3n(C)c(=O)ccc3c2)c1