Reaction Details
TargetProstaglandin G/H synthase 2
LigandBDBM50110484
Substrate/Competitorn/a
Meas. Tech.ChEMBL_429562 (CHEMBL919560)
IC50 45±n/a nM
Citation Pommery, NTaverne, TTelliez, AGoossens, LCharlier, CPommery, JGoossens, JFHoussin, RDurant, FHénichart, JP New COX-2/5-LOX inhibitors: apoptosis-inducing agents potentially useful in prostate cancer chemotherapy. J Med Chem47:6195-206 (2004) 
 
Prostaglandin G/H synthase 2
Name:Prostaglandin G/H synthase 2
Type:Enzyme
Mol. Mass.:69003.89
Organism:Homo sapiens (Human)
Description:Recombinant Cox-2 provided by Cayman (Cayman Chemical Co.,Ann Arbor, MI).
Residue:604
BDBM50110484
NameBDBM50110484
Synonyms:3-((3-fluoro-5-(1-methoxycyclohexyl)phenoxy)methyl)-1-(4-(methylsulfonyl)phenyl)-5-phenyl-1H-pyrazole 3-[3-Fluoro-5-(4-methoxy-tetrahydro-pyran-4-yl)-phenoxymethyl]-1-(4-methanesulfonyl-phenyl)-5-phenyl-1H-pyrazole CHEMBL423638
TypeSmall organic molecule
Emp. Form.C29H29FN2O5S
Mol. Mass.536.614
SMILESCOC1(CCOCC1)c1cc(F)cc(OCc2cc(-c3ccccc3)n(n2)-c2ccc(cc2)S(C)(=O)=O)c1