Reaction Details
TargetHistamine H2 receptor
LigandBDBM50156865
Substrate/Competitorn/a
Meas. Tech.ChEMBL_429753 (CHEMBL914453)
IC50 10000±n/a nM
Citation Fonquerna, SMiralpeix, MPagès, LPuig, CCardús, AAntón, FCárdenas, AVilella, DAparici, MCalaf, EPrieto, JGras, JHuerta, JMWarrellow, GBeleta, JRyder, H Synthesis and structure-activity relationships of novel histamine H1 antagonists: indolylpiperidinyl benzoic acid derivatives. J Med Chem47:6326-37 (2004) 
 
Histamine H2 receptor
Name:Histamine H2 receptor
Type:G Protein-Coupled Receptor (GPCR)
Mol. Mass.:40115.31
Organism:Homo sapiens (Human)
Description:n/a
Residue:359
BDBM50156865
NameBDBM50156865
Synonyms:2-(2-(4-(1-(furan-2-ylmethyl)-1H-indol-3-yl)piperidin-1-yl)ethoxy)benzoic acid | CHEMBL374218
TypeSmall organic molecule
Emp. Form.C27H28N2O4
Mol. Mass.444.5222
SMILESOC(=O)c1ccccc1OCCN1CCC(CC1)c1cn(Cc2ccco2)c2ccccc12