Reaction Details
TargetHistamine H1 receptor
LigandBDBM50156871
Substrate/Competitorn/a
Meas. Tech.ChEMBL_429751 (CHEMBL914451)
IC50 218±n/a nM
Citation Fonquerna, SMiralpeix, MPagès, LPuig, CCardús, AAntón, FCárdenas, AVilella, DAparici, MCalaf, EPrieto, JGras, JHuerta, JMWarrellow, GBeleta, JRyder, H Synthesis and structure-activity relationships of novel histamine H1 antagonists: indolylpiperidinyl benzoic acid derivatives. J Med Chem47:6326-37 (2004) 
 
Histamine H1 receptor
Name:Histamine H1 receptor
Type:G Protein-Coupled Receptor (GPCR)
Mol. Mass.:55641.53
Organism:Cavia porcellus (domestic guinea pig)
Description:Guinea pig cerebellum was used in binding assay.
Residue:488
BDBM50156871
NameBDBM50156871
Synonyms:3-{4-[1-(2-Ethoxy-ethyl)-1H-indol-3-yl]-piperidin-1-ylmethyl}-benzoic acid CHEMBL360791
TypeSmall organic molecule
Emp. Form.C25H30N2O3
Mol. Mass.406.5173
SMILESCCOCCn1cc(C2CCN(Cc3cccc(c3)C(O)=O)CC2)c2ccccc12