Reaction Details
TargetHistamine H1 receptor
LigandBDBM50156866
Substrate/Competitorn/a
Meas. Tech.ChEMBL_429751 (CHEMBL914451)
IC50 91±n/a nM
Citation Fonquerna, SMiralpeix, MPagès, LPuig, CCardús, AAntón, FCárdenas, AVilella, DAparici, MCalaf, EPrieto, JGras, JHuerta, JMWarrellow, GBeleta, JRyder, H Synthesis and structure-activity relationships of novel histamine H1 antagonists: indolylpiperidinyl benzoic acid derivatives. J Med Chem47:6326-37 (2004) 
 
Histamine H1 receptor
Name:Histamine H1 receptor
Type:G Protein-Coupled Receptor (GPCR)
Mol. Mass.:55641.53
Organism:Cavia porcellus (domestic guinea pig)
Description:Guinea pig cerebellum was used in binding assay.
Residue:488
BDBM50156866
NameBDBM50156866
Synonyms:5-[4-(6-fluoro-1-thiophen-2-ylmethyl-1H-indol-3-yl)piperidin-1-ylmethyl]-2-methoxybenzoic acid | CHEMBL222139
TypeSmall organic molecule
Emp. Form.C27H27FN2O3S
Mol. Mass.478.578
SMILESCOc1ccc(CN2CCC(CC2)c2cn(Cc3cccs3)c3cc(F)ccc23)cc1C(O)=O