Reaction Details
TargetHistamine H2 receptor
LigandBDBM50156869
Substrate/Competitorn/a
Meas. Tech.ChEMBL_429753 (CHEMBL914453)
IC50>10000±n/a nM
Citation Fonquerna, SMiralpeix, MPagès, LPuig, CCardús, AAntón, FCárdenas, AVilella, DAparici, MCalaf, EPrieto, JGras, JHuerta, JMWarrellow, GBeleta, JRyder, H Synthesis and structure-activity relationships of novel histamine H1 antagonists: indolylpiperidinyl benzoic acid derivatives. J Med Chem47:6326-37 (2004) 
 
Histamine H2 receptor
Name:Histamine H2 receptor
Type:G Protein-Coupled Receptor (GPCR)
Mol. Mass.:40115.31
Organism:Homo sapiens (Human)
Description:n/a
Residue:359
BDBM50156869
NameBDBM50156869
Synonyms:2-{2-[4-(1-cyclopropylmethyl-1H-indol-3-yl)piperidin-1-yl]ethoxy}benzoic acid | CHEMBL375208
TypeSmall organic molecule
Emp. Form.C26H30N2O3
Mol. Mass.418.528
SMILESOC(=O)c1ccccc1OCCN1CCC(CC1)c1cn(CC2CC2)c2ccccc12