Reaction Details
TargetHistamine H1 receptor
LigandBDBM50156895
Substrate/Competitorn/a
Meas. Tech.ChEMBL_429751 (CHEMBL914451)
IC50>500±n/a nM
Citation Fonquerna, SMiralpeix, MPagès, LPuig, CCardús, AAntón, FCárdenas, AVilella, DAparici, MCalaf, EPrieto, JGras, JHuerta, JMWarrellow, GBeleta, JRyder, H Synthesis and structure-activity relationships of novel histamine H1 antagonists: indolylpiperidinyl benzoic acid derivatives. J Med Chem47:6326-37 (2004) 
 
Histamine H1 receptor
Name:Histamine H1 receptor
Type:G Protein-Coupled Receptor (GPCR)
Mol. Mass.:55641.53
Organism:Cavia porcellus (domestic guinea pig)
Description:Guinea pig cerebellum was used in binding assay.
Residue:488
BDBM50156895
NameBDBM50156895
Synonyms:2-(2-(4-(1-(2-ethoxyethyl)-6-(trifluoromethyl)-1H-indol-3-yl)piperidin-1-yl)ethoxy)benzoic acid | CHEMBL221718
TypeSmall organic molecule
Emp. Form.C27H31F3N2O4
Mol. Mass.504.5412
SMILESCCOCCn1cc(C2CCN(CCOc3ccccc3C(O)=O)CC2)c2ccc(cc12)C(F)(F)F