Reaction Details
TargetHistamine H1 receptor
LigandBDBM50156886
Substrate/Competitorn/a
Meas. Tech.ChEMBL_429751 (CHEMBL914451)
IC50 37±n/a nM
Citation Fonquerna, SMiralpeix, MPagès, LPuig, CCardús, AAntón, FCárdenas, AVilella, DAparici, MCalaf, EPrieto, JGras, JHuerta, JMWarrellow, GBeleta, JRyder, H Synthesis and structure-activity relationships of novel histamine H1 antagonists: indolylpiperidinyl benzoic acid derivatives. J Med Chem47:6326-37 (2004) 
 
Histamine H1 receptor
Name:Histamine H1 receptor
Type:G Protein-Coupled Receptor (GPCR)
Mol. Mass.:55641.53
Organism:Cavia porcellus (domestic guinea pig)
Description:Guinea pig cerebellum was used in binding assay.
Residue:488
BDBM50156886
NameBDBM50156886
Synonyms:2-{2-[4-(6-fluoro-1-furan-2-ylmethyl-1H-indol-3-yl)piperidin-1-yl]ethoxy}benzoic acid | CHEMBL223837
TypeSmall organic molecule
Emp. Form.C27H27FN2O4
Mol. Mass.462.5127
SMILESOC(=O)c1ccccc1OCCN1CCC(CC1)c1cn(Cc2ccco2)c2cc(F)ccc12