Reaction Details
TargetHistamine H2 receptor
LigandBDBM50156875
Substrate/Competitorn/a
Meas. Tech.ChEMBL_429753 (CHEMBL914453)
IC50 850±n/a nM
Citation Fonquerna, SMiralpeix, MPagès, LPuig, CCardús, AAntón, FCárdenas, AVilella, DAparici, MCalaf, EPrieto, JGras, JHuerta, JMWarrellow, GBeleta, JRyder, H Synthesis and structure-activity relationships of novel histamine H1 antagonists: indolylpiperidinyl benzoic acid derivatives. J Med Chem47:6326-37 (2004) 
 
Histamine H2 receptor
Name:Histamine H2 receptor
Type:G Protein-Coupled Receptor (GPCR)
Mol. Mass.:40115.31
Organism:Homo sapiens (Human)
Description:n/a
Residue:359
BDBM50156875
NameBDBM50156875
Synonyms:2-(2-(4-(1-(2-ethoxyethyl)-1H-indol-3-yl)piperidin-1-yl)ethoxy)-6-fluorobenzoic acid | CHEMBL376025
TypeSmall organic molecule
Emp. Form.C26H31FN2O4
Mol. Mass.454.5337
SMILESCCOCCn1cc(C2CCN(CCOc3cccc(F)c3C(O)=O)CC2)c2ccccc12