Reaction Details
TargetHistamine H1 receptor
LigandBDBM50156892
Substrate/Competitorn/a
Meas. Tech.ChEMBL_429751 (CHEMBL914451)
IC50 98±n/a nM
Citation Fonquerna, SMiralpeix, MPagès, LPuig, CCardús, AAntón, FCárdenas, AVilella, DAparici, MCalaf, EPrieto, JGras, JHuerta, JMWarrellow, GBeleta, JRyder, H Synthesis and structure-activity relationships of novel histamine H1 antagonists: indolylpiperidinyl benzoic acid derivatives. J Med Chem47:6326-37 (2004) 
 
Histamine H1 receptor
Name:Histamine H1 receptor
Type:G Protein-Coupled Receptor (GPCR)
Mol. Mass.:55641.53
Organism:Cavia porcellus (domestic guinea pig)
Description:Guinea pig cerebellum was used in binding assay.
Residue:488
BDBM50156892
NameBDBM50156892
Synonyms:2-(2-(4-(1-(thiophen-2-ylmethyl)-1H-indol-3-yl)piperidin-1-yl)ethoxy)benzoic acid | CHEMBL222881
TypeSmall organic molecule
Emp. Form.C27H28N2O3S
Mol. Mass.460.588
SMILESOC(=O)c1ccccc1OCCN1CCC(CC1)c1cn(Cc2cccs2)c2ccccc12