Reaction Details
TargetHistamine H3 receptor
LigandBDBM50053631
Substrate/Competitorn/a
Meas. Tech.ChEMBL_303027 (CHEMBL830414)
Ki 410±n/a nM
Citation Zaragoza, FStephensen, HPeschke, BRimvall, K 2-(4-alkylpiperazin-1-yl)quinolines as a new class of imidazole-free histamine H3 receptor antagonists. J Med Chem48:306-11 (2005) 
 
Histamine H3 receptor
Name:Histamine H3 receptor
Type:G Protein-Coupled Receptor (GPCR)
Mol. Mass.:48691.47
Organism:Homo sapiens (Human)
Description:Binding assays were using CHO cells stably expressing hH3R receptors.
Residue:445
BDBM50053631
NameBDBM50053631
Synonyms:2-(4-Methyl-piperazin-1-yl)-quinoline CHEMBL288591
TypeSmall organic molecule
Emp. Form.C14H17N3
Mol. Mass.227.3049
SMILESCN1CCN(CC1)c1ccc2ccccc2n1