Reaction Details
TargetHistone deacetylase 4
LigandBDBM50322422
Substrate/Competitorn/a
Meas. Tech.ChEMBL_2186678 (CHEMBL5098760)
IC50 3000±n/a nM
Citation Qiu, XZhu, LWang, HTan, YYang, ZYang, LWan, L From natural products to HDAC inhibitors: An overview of drug discovery and design strategy. Bioorg Med Chem52:0 (2021) 
 
Histone deacetylase 4
Name:Histone deacetylase 4
Type:Enzyme
Mol. Mass.:119049.39
Organism:Homo sapiens (Human)
Description:P56524
Residue:1084
BDBM50322422
NameBDBM50322422
Synonyms:CHEMBL1173445 | Largazole
TypeSmall organic molecule
Emp. Form.C29H42N4O5S3
Mol. Mass.622.863
SMILESCCCCCCCC(=O)SCC\C=C\[C@@H]1CC(=O)NCc2nc(cs2)C2=N[C@@](C)(CS2)C(=O)N[C@@H](C(C)C)C(=O)O1