Reaction Details
TargetCannabinoid receptor 1
LigandBDBM50160094
Substrate/Competitorn/a
Meas. Tech.ChEMBL_305569 (CHEMBL827163)
IC50 66±n/a nM
Citation Meurer, LCFinke, PEMills, SGWalsh, TFToupence, RBDebenham, JSGoulet, MTWang, JTong, XFong, TMLao, JSchaeffer, MTChen, JShen, CPSloan Stribling, DShearman, LPStrack, AMVan der Ploeg, LH Synthesis and SAR of 5,6-diarylpyridines as human CB1 inverse agonists. Bioorg Med Chem Lett15:645-51 (2005) 
 
Cannabinoid receptor 1
Name:Cannabinoid receptor 1
Type:G Protein-Coupled Receptor (GPCR)
Mol. Mass.:52868.96
Organism:Homo sapiens (Human)
Description:P21554
Residue:472
BDBM50160094
NameBDBM50160094
Synonyms:2-(3,4-Difluoro-benzyloxy)-6-(2,4-difluoro-phenyl)-5-(4-fluoro-phenyl)-nicotinonitrile | CHEMBL362215
TypeSmall organic molecule
Emp. Form.C25H13F5N2O
Mol. Mass.452.3755
SMILESFc1ccc(cc1)-c1cc(C#N)c(OCc2ccc(F)c(F)c2)nc1-c1ccc(F)cc1F