Reaction Details
TargetCannabinoid receptor 1
LigandBDBM50160099
Substrate/Competitorn/a
Meas. Tech.ChEMBL_305569 (CHEMBL827163)
IC50 3.1±n/a nM
Citation Meurer, LCFinke, PEMills, SGWalsh, TFToupence, RBDebenham, JSGoulet, MTWang, JTong, XFong, TMLao, JSchaeffer, MTChen, JShen, CPSloan Stribling, DShearman, LPStrack, AMVan der Ploeg, LH Synthesis and SAR of 5,6-diarylpyridines as human CB1 inverse agonists. Bioorg Med Chem Lett15:645-51 (2005) 
 
Cannabinoid receptor 1
Name:Cannabinoid receptor 1
Type:G Protein-Coupled Receptor (GPCR)
Mol. Mass.:52868.96
Organism:Homo sapiens (Human)
Description:P21554
Residue:472
BDBM50160099
NameBDBM50160099
Synonyms:5-(4-Chloro-phenyl)-6-(2,4-dichloro-phenyl)-2-(4-fluoro-benzyloxy)-nicotinonitrile | CHEMBL425527
TypeSmall organic molecule
Emp. Form.C25H14Cl3FN2O
Mol. Mass.483.749
SMILESFc1ccc(COc2nc(-c3ccc(Cl)cc3Cl)c(cc2C#N)-c2ccc(Cl)cc2)cc1