Reaction Details
TargetCannabinoid receptor 1
LigandBDBM50160101
Substrate/Competitorn/a
Meas. Tech.ChEMBL_305569 (CHEMBL827163)
IC50 6000±n/a nM
Citation Meurer, LCFinke, PEMills, SGWalsh, TFToupence, RBDebenham, JSGoulet, MTWang, JTong, XFong, TMLao, JSchaeffer, MTChen, JShen, CPSloan Stribling, DShearman, LPStrack, AMVan der Ploeg, LH Synthesis and SAR of 5,6-diarylpyridines as human CB1 inverse agonists. Bioorg Med Chem Lett15:645-51 (2005) 
 
Cannabinoid receptor 1
Name:Cannabinoid receptor 1
Type:G Protein-Coupled Receptor (GPCR)
Mol. Mass.:52868.96
Organism:Homo sapiens (Human)
Description:P21554
Residue:472
BDBM50160101
NameBDBM50160101
Synonyms:1-Benzyl-6-(4-chloro-phenyl)-2-oxo-5-phenyl-1,2-dihydro-pyridine-3-carbonitrile | CHEMBL180252
TypeSmall organic molecule
Emp. Form.C25H17ClN2O
Mol. Mass.396.868
SMILESClc1ccc(cc1)-c1c(cc(C#N)c(=O)n1Cc1ccccc1)-c1ccccc1