Reaction Details
TargetCannabinoid receptor 2
LigandBDBM50160107
Substrate/Competitorn/a
Meas. Tech.ChEMBL_305570 (CHEMBL827164)
IC50>2000±n/a nM
Citation Meurer, LCFinke, PEMills, SGWalsh, TFToupence, RBDebenham, JSGoulet, MTWang, JTong, XFong, TMLao, JSchaeffer, MTChen, JShen, CPSloan Stribling, DShearman, LPStrack, AMVan der Ploeg, LH Synthesis and SAR of 5,6-diarylpyridines as human CB1 inverse agonists. Bioorg Med Chem Lett15:645-51 (2005) 
 
Cannabinoid receptor 2
Name:Cannabinoid receptor 2
Type:G Protein-Coupled Receptor (GPCR)
Mol. Mass.:39690.94
Organism:Homo sapiens (Human)
Description:P34972
Residue:360
BDBM50160107
NameBDBM50160107
Synonyms:2-Benzyloxy-5-(4-chloro-phenyl)-6-(2,4-dichloro-phenyl)-nicotinonitrile | CHEMBL361119
TypeSmall organic molecule
Emp. Form.C25H15Cl3N2O
Mol. Mass.465.758
SMILESClc1ccc(cc1)-c1cc(C#N)c(OCc2ccccc2)nc1-c1ccc(Cl)cc1Cl