Reaction Details
TargetCannabinoid receptor 1
LigandBDBM50160119
Substrate/Competitorn/a
Meas. Tech.ChEMBL_305569 (CHEMBL827163)
IC50 52±n/a nM
Citation Meurer, LCFinke, PEMills, SGWalsh, TFToupence, RBDebenham, JSGoulet, MTWang, JTong, XFong, TMLao, JSchaeffer, MTChen, JShen, CPSloan Stribling, DShearman, LPStrack, AMVan der Ploeg, LH Synthesis and SAR of 5,6-diarylpyridines as human CB1 inverse agonists. Bioorg Med Chem Lett15:645-51 (2005) 
 
Cannabinoid receptor 1
Name:Cannabinoid receptor 1
Type:G Protein-Coupled Receptor (GPCR)
Mol. Mass.:52868.96
Organism:Homo sapiens (Human)
Description:P21554
Residue:472
BDBM50160119
NameBDBM50160119
Synonyms:2-Chloro-5-(4-chloro-phenyl)-6-(2,4-dichloro-phenyl)-N-propyl-nicotinamide | CHEMBL359500
TypeSmall organic molecule
Emp. Form.C21H16Cl4N2O
Mol. Mass.454.177
SMILESCCCNC(=O)c1cc(-c2ccc(Cl)cc2)c(nc1Cl)-c1ccc(Cl)cc1Cl