Reaction Details
TargetCannabinoid receptor 1
LigandBDBM50160126
Substrate/Competitorn/a
Meas. Tech.ChEMBL_305569 (CHEMBL827163)
IC50 530±n/a nM
Citation Meurer, LCFinke, PEMills, SGWalsh, TFToupence, RBDebenham, JSGoulet, MTWang, JTong, XFong, TMLao, JSchaeffer, MTChen, JShen, CPSloan Stribling, DShearman, LPStrack, AMVan der Ploeg, LH Synthesis and SAR of 5,6-diarylpyridines as human CB1 inverse agonists. Bioorg Med Chem Lett15:645-51 (2005) 
 
Cannabinoid receptor 1
Name:Cannabinoid receptor 1
Type:G Protein-Coupled Receptor (GPCR)
Mol. Mass.:52868.96
Organism:Homo sapiens (Human)
Description:P21554
Residue:472
BDBM50160126
NameBDBM50160126
Synonyms:2-Benzyloxy-6-(4-dimethylamino-phenyl)-5-(4-methoxy-phenyl)-nicotinonitrile | CHEMBL181888
TypeSmall organic molecule
Emp. Form.C28H25N3O2
Mol. Mass.435.517
SMILESCOc1ccc(cc1)-c1cc(C#N)c(OCc2ccccc2)nc1-c1ccc(cc1)N(C)C