Reaction Details
TargetCannabinoid receptor 1
LigandBDBM50160130
Substrate/Competitorn/a
Meas. Tech.ChEMBL_305569 (CHEMBL827163)
IC50 2000±n/a nM
Citation Meurer, LCFinke, PEMills, SGWalsh, TFToupence, RBDebenham, JSGoulet, MTWang, JTong, XFong, TMLao, JSchaeffer, MTChen, JShen, CPSloan Stribling, DShearman, LPStrack, AMVan der Ploeg, LH Synthesis and SAR of 5,6-diarylpyridines as human CB1 inverse agonists. Bioorg Med Chem Lett15:645-51 (2005) 
 
Cannabinoid receptor 1
Name:Cannabinoid receptor 1
Type:G Protein-Coupled Receptor (GPCR)
Mol. Mass.:52868.96
Organism:Homo sapiens (Human)
Description:P21554
Residue:472
BDBM50160130
NameBDBM50160130
Synonyms:1-Benzyl-5-(4-chloro-phenyl)-6-(2,4-dichloro-phenyl)-2-oxo-1,2-dihydro-pyridine-3-carbonitrile | CHEMBL178987
TypeSmall organic molecule
Emp. Form.C25H15Cl3N2O
Mol. Mass.465.758
SMILESClc1ccc(cc1)-c1cc(C#N)c(=O)n(Cc2ccccc2)c1-c1ccc(Cl)cc1Cl