Reaction Details
TargetCannabinoid receptor 1
LigandBDBM50160145
Substrate/Competitorn/a
Meas. Tech.ChEMBL_305569 (CHEMBL827163)
IC50 1.9±n/a nM
Citation Meurer, LCFinke, PEMills, SGWalsh, TFToupence, RBDebenham, JSGoulet, MTWang, JTong, XFong, TMLao, JSchaeffer, MTChen, JShen, CPSloan Stribling, DShearman, LPStrack, AMVan der Ploeg, LH Synthesis and SAR of 5,6-diarylpyridines as human CB1 inverse agonists. Bioorg Med Chem Lett15:645-51 (2005) 
 
Cannabinoid receptor 1
Name:Cannabinoid receptor 1
Type:G Protein-Coupled Receptor (GPCR)
Mol. Mass.:52868.96
Organism:Homo sapiens (Human)
Description:P21554
Residue:472
BDBM50160145
NameBDBM50160145
Synonyms:2-Butoxy-5-(4-chloro-phenyl)-6-(2,4-dichloro-phenyl)-nicotinic acid methyl ester | CHEMBL425870
TypeSmall organic molecule
Emp. Form.C23H20Cl3NO3
Mol. Mass.464.769
SMILESCCCCOc1nc(-c2ccc(Cl)cc2Cl)c(cc1C(=O)OC)-c1ccc(Cl)cc1