Reaction Details
TargetKappa-type opioid receptor
LigandBDBM50160833
Substrate/Competitorn/a
Meas. Tech.ChEMBL_303046 (CHEMBL828016)
Ki 2.9±n/a nM
Citation Kumar, VGuo, DCassel, JADaubert, JDDehaven, RNDehaven-Hudkins, DLGauntner, EKGottshall, SLGreiner, SLKoblish, MLittle, PJMansson, EMaycock, AL Synthesis and evaluation of novel peripherally restricted kappa-opioid receptor agonists. Bioorg Med Chem Lett15:1091-5 (2005) 
 
Kappa-type opioid receptor
Name:Kappa-type opioid receptor
Type:G Protein-Coupled Receptor (GPCR)
Mol. Mass.:42648.76
Organism:Homo sapiens (Human)
Description:P41145
Residue:380
BDBM50160833
NameBDBM50160833
Synonyms:CHEMBL360678 | [3-(1-{Methyl-[2-(4-trifluoromethyl-phenyl)-acetyl]-amino}-2-pyrrolidin-1-yl-ethyl)-phenoxy]-acetic acid tert-butyl ester
TypeSmall organic molecule
Emp. Form.C28H35F3N2O4
Mol. Mass.520.5837
SMILESCN(C(CN1CCCC1)c1cccc(OCC(=O)OC(C)(C)C)c1)C(=O)Cc1ccc(cc1)C(F)(F)F