Reaction Details
TargetKappa-type opioid receptor
LigandBDBM83435
Substrate/Competitorn/a
Meas. Tech.ChEMBL_303046 (CHEMBL828016)
Ki 2.69±n/a nM
Citation Kumar, VGuo, DCassel, JADaubert, JDDehaven, RNDehaven-Hudkins, DLGauntner, EKGottshall, SLGreiner, SLKoblish, MLittle, PJMansson, EMaycock, AL Synthesis and evaluation of novel peripherally restricted kappa-opioid receptor agonists. Bioorg Med Chem Lett15:1091-5 (2005) 
 
Kappa-type opioid receptor
Name:Kappa-type opioid receptor
Type:G Protein-Coupled Receptor (GPCR)
Mol. Mass.:42648.76
Organism:Homo sapiens (Human)
Description:P41145
Residue:380
BDBM83435
NameBDBM83435
Synonyms:2-[3-[1-[2-(3,4-dichlorophenyl)ethanoyl-methyl-amino]-2-pyrrolidin-1-yl-ethyl]phenoxy]ethanoic acid;hydrochloride 2-[3-[1-[[2-(3,4-dichlorophenyl)acetyl]-methyl-amino]-2-pyrrolidino-ethyl]phenoxy]acetic acid;hydrochloride CHEMBL23472 MLS002153186 cid_129407
TypeSmall organic molecule
Emp. Form.C23H26Cl2N2O4
Mol. Mass.465.37
SMILESCN(C(CN1CCCC1)c1cccc(OCC(O)=O)c1)C(=O)Cc1ccc(Cl)c(Cl)c1